{"text_format":"3","workbook":"xlsx","n_sheets":3,"sheets":["Bewegungen","Übersicht","Listen"],"not_rendered":{"defined_names":5},"read":"whole","date_system":"1900"}

{"sheet":"Bewegungen","index":0,"n_rows":505,"n_cols":9,"rows_kept":505,"merged":[[0,0,0,8],[3,0,3,8]]}
["Haushaltsbuch Excel Vorlage"]
[]
["Jahr",{"$f":"Listen!$B$2","v":2026},null,"Startsaldo",{"$f":"Listen!$B$3","v":{"v":1000,"d":"€ 1,000.00"}},null,"Aktueller Saldo",{"$f":"IFERROR(LOOKUP(9.99999999999999E+307,$I$6:$I$505),Listen!$B$3)","v":{"v":5848.91,"d":"€ 5,848.91"}}]
["Hinweis: Betrag (€) immer positiv eingeben; das Vorzeichen ergibt sich automatisch aus 'Typ'."]
["Datum","Typ","Kategorie","Konto","Beschreibung","Betrag (€)","Betrag (±)","Monat","Saldo (€)"]
["2026-01-02","Einnahme","Gehalt","Bank","Monatsgehalt",{"v":3000,"d":"€ 3,000.00"},{"$f":"IF($A6=\"\",\"\",IF($B6=\"Ausgabe\",-ABS($F6),ABS($F6)))","v":{"v":3000,"d":"€ 3,000.00"}},{"$f":"IF($A6=\"\",\"\",DATE(YEAR($A6),MONTH($A6),1))","v":"2026-01-01"},{"$f":"IF($A6=\"\",\"\",Listen!$B$3 + SUM($G$6:G6))","v":{"v":4000,"d":"€ 4,000.00"}}]
["2026-01-03","Ausgabe","Miete / Wohnen","Bank","Miete Januar",{"v":900,"d":"€ 900.00"},{"v":-900,"d":"-€ 900.00"},"2026-01-01",{"$f":"IF($A7=\"\",\"\",Listen!$B$3 + SUM($G$6:G7))","v":{"v":3100,"d":"€ 3,100.00"}}]
["2026-01-05","Ausgabe","Lebensmittel","Karte","Wocheneinkauf",{"v":85.4,"d":"€ 85.40"},{"v":-85.4,"d":"-€ 85.40"},"2026-01-01",{"$f":"IF($A8=\"\",\"\",Listen!$B$3 + SUM($G$6:G8))","v":{"v":3014.6,"d":"€ 3,014.60"}}]
["2026-01-08","Ausgabe","Transport","Karte","ÖPNV Ticket",{"v":49,"d":"€ 49.00"},{"v":-49,"d":"-€ 49.00"},"2026-01-01",{"$f":"IF($A9=\"\",\"\",Listen!$B$3 + SUM($G$6:G9))","v":{"v":2965.6,"d":"€ 2,965.60"}}]
["2026-01-12","Ausgabe","Abonnements","Bank","Streaming",{"v":12.99,"d":"€ 12.99"},{"v":-12.99,"d":"-€ 12.99"},"2026-01-01",{"$f":"IF($A10=\"\",\"\",Listen!$B$3 + SUM($G$6:G10))","v":{"v":2952.6099999999997,"d":"€ 2,952.61"}}]
["2026-01-15","Ausgabe","Freizeit","Karte","Restaurant",{"v":38.5,"d":"€ 38.50"},{"v":-38.5,"d":"-€ 38.50"},"2026-01-01",{"$f":"IF($A11=\"\",\"\",Listen!$B$3 + SUM($G$6:G11))","v":{"v":2914.1099999999997,"d":"€ 2,914.11"}}]
["2026-02-01","Einnahme","Gehalt","Bank","Monatsgehalt",{"v":3000,"d":"€ 3,000.00"},{"v":3000,"d":"€ 3,000.00"},"2026-02-01",{"$f":"IF($A12=\"\",\"\",Listen!$B$3 + SUM($G$6:G12))","v":{"v":5914.11,"d":"€ 5,914.11"}}]
["2026-02-03","Ausgabe","Nebenkosten","Bank","Strom",{"v":65.2,"d":"€ 65.20"},{"v":-65.2,"d":"-€ 65.20"},"2026-02-01",{"$f":"IF($A13=\"\",\"\",Listen!$B$3 + SUM($G$6:G13))","v":{"v":5848.91,"d":"€ 5,848.91"}}]
[{"$nulls":6},"","",{"$f":"IF($A14=\"\",\"\",Listen!$B$3 + SUM($G$6:G14))","v":""}]
[{"$nulls":6},"","",{"$f":"IF($A15=\"\",\"\",Listen!$B$3 + SUM($G$6:G15))","v":""}]
[{"$nulls":6},"","",{"$f":"IF($A16=\"\",\"\",Listen!$B$3 + SUM($G$6:G16))","v":""}]
[{"$nulls":6},"","",{"$f":"IF($A17=\"\",\"\",Listen!$B$3 + SUM($G$6:G17))","v":""}]
[{"$nulls":6},"","",{"$f":"IF($A18=\"\",\"\",Listen!$B$3 + SUM($G$6:G18))","v":""}]
[{"$nulls":6},"","",{"$f":"IF($A19=\"\",\"\",Listen!$B$3 + SUM($G$6:G19))","v":""}]
[{"$nulls":6},"","",{"$f":"IF($A20=\"\",\"\",Listen!$B$3 + SUM($G$6:G20))","v":""}]
[{"$nulls":6},"","",{"$f":"IF($A21=\"\",\"\",Listen!$B$3 + SUM($G$6:G21))","v":""}]
[{"$nulls":6},"","",{"$f":"IF($A22=\"\",\"\",Listen!$B$3 + SUM($G$6:G22))","v":""}]
[{"$nulls":6},"","",{"$f":"IF($A23=\"\",\"\",Listen!$B$3 + SUM($G$6:G23))","v":""}]
[{"$nulls":6},"","",{"$f":"IF($A24=\"\",\"\",Listen!$B$3 + SUM($G$6:G24))","v":""}]
[{"$nulls":6},"","",{"$f":"IF($A25=\"\",\"\",Listen!$B$3 + SUM($G$6:G25))","v":""}]
[{"$nulls":6},"","",{"$f":"IF($A26=\"\",\"\",Listen!$B$3 + SUM($G$6:G26))","v":""}]
[{"$nulls":6},"","",{"$f":"IF($A27=\"\",\"\",Listen!$B$3 + SUM($G$6:G27))","v":""}]
[{"$nulls":6},"","",{"$f":"IF($A28=\"\",\"\",Listen!$B$3 + SUM($G$6:G28))","v":""}]
[{"$nulls":6},"","",{"$f":"IF($A29=\"\",\"\",Listen!$B$3 + SUM($G$6:G29))","v":""}]
[{"$nulls":6},"","",{"$f":"IF($A30=\"\",\"\",Listen!$B$3 + SUM($G$6:G30))","v":""}]
[{"$nulls":6},"","",{"$f":"IF($A31=\"\",\"\",Listen!$B$3 + SUM($G$6:G31))","v":""}]
[{"$nulls":6},"","",{"$f":"IF($A32=\"\",\"\",Listen!$B$3 + SUM($G$6:G32))","v":""}]
[{"$nulls":6},"","",{"$f":"IF($A33=\"\",\"\",Listen!$B$3 + SUM($G$6:G33))","v":""}]
[{"$nulls":6},"","",{"$f":"IF($A34=\"\",\"\",Listen!$B$3 + SUM($G$6:G34))","v":""}]
[{"$nulls":6},"","",{"$f":"IF($A35=\"\",\"\",Listen!$B$3 + SUM($G$6:G35))","v":""}]
[{"$nulls":6},"","",{"$f":"IF($A36=\"\",\"\",Listen!$B$3 + SUM($G$6:G36))","v":""}]
[{"$nulls":6},"","",{"$f":"IF($A37=\"\",\"\",Listen!$B$3 + SUM($G$6:G37))","v":""}]
[{"$nulls":6},"","",{"$f":"IF($A38=\"\",\"\",Listen!$B$3 + SUM($G$6:G38))","v":""}]
[{"$nulls":6},"","",{"$f":"IF($A39=\"\",\"\",Listen!$B$3 + SUM($G$6:G39))","v":""}]
[{"$nulls":6},"","",{"$f":"IF($A40=\"\",\"\",Listen!$B$3 + SUM($G$6:G40))","v":""}]
[{"$nulls":6},"","",{"$f":"IF($A41=\"\",\"\",Listen!$B$3 + SUM($G$6:G41))","v":""}]
[{"$nulls":6},"","",{"$f":"IF($A42=\"\",\"\",Listen!$B$3 + SUM($G$6:G42))","v":""}]
[{"$nulls":6},"","",{"$f":"IF($A43=\"\",\"\",Listen!$B$3 + SUM($G$6:G43))","v":""}]
[{"$nulls":6},"","",{"$f":"IF($A44=\"\",\"\",Listen!$B$3 + SUM($G$6:G44))","v":""}]
[{"$nulls":6},"","",{"$f":"IF($A45=\"\",\"\",Listen!$B$3 + SUM($G$6:G45))","v":""}]
[{"$nulls":6},"","",{"$f":"IF($A46=\"\",\"\",Listen!$B$3 + SUM($G$6:G46))","v":""}]
[{"$nulls":6},"","",{"$f":"IF($A47=\"\",\"\",Listen!$B$3 + SUM($G$6:G47))","v":""}]
[{"$nulls":6},"","",{"$f":"IF($A48=\"\",\"\",Listen!$B$3 + SUM($G$6:G48))","v":""}]
[{"$nulls":6},"","",{"$f":"IF($A49=\"\",\"\",Listen!$B$3 + SUM($G$6:G49))","v":""}]
[{"$nulls":6},"","",{"$f":"IF($A50=\"\",\"\",Listen!$B$3 + SUM($G$6:G50))","v":""}]
[{"$nulls":6},"","",{"$f":"IF($A51=\"\",\"\",Listen!$B$3 + SUM($G$6:G51))","v":""}]
[{"$nulls":6},"","",{"$f":"IF($A52=\"\",\"\",Listen!$B$3 + SUM($G$6:G52))","v":""}]
[{"$nulls":6},"","",{"$f":"IF($A53=\"\",\"\",Listen!$B$3 + SUM($G$6:G53))","v":""}]
[{"$nulls":6},"","",{"$f":"IF($A54=\"\",\"\",Listen!$B$3 + SUM($G$6:G54))","v":""}]
[{"$nulls":6},"","",{"$f":"IF($A55=\"\",\"\",Listen!$B$3 + SUM($G$6:G55))","v":""}]
[{"$nulls":6},"","",{"$f":"IF($A56=\"\",\"\",Listen!$B$3 + SUM($G$6:G56))","v":""}]
[{"$nulls":6},"","",{"$f":"IF($A57=\"\",\"\",Listen!$B$3 + SUM($G$6:G57))","v":""}]
[{"$nulls":6},"","",{"$f":"IF($A58=\"\",\"\",Listen!$B$3 + SUM($G$6:G58))","v":""}]
[{"$nulls":6},"","",{"$f":"IF($A59=\"\",\"\",Listen!$B$3 + SUM($G$6:G59))","v":""}]
[{"$nulls":6},"","",{"$f":"IF($A60=\"\",\"\",Listen!$B$3 + SUM($G$6:G60))","v":""}]
[{"$nulls":6},"","",{"$f":"IF($A61=\"\",\"\",Listen!$B$3 + SUM($G$6:G61))","v":""}]
[{"$nulls":6},"","",{"$f":"IF($A62=\"\",\"\",Listen!$B$3 + SUM($G$6:G62))","v":""}]
[{"$nulls":6},"","",{"$f":"IF($A63=\"\",\"\",Listen!$B$3 + SUM($G$6:G63))","v":""}]
[{"$nulls":6},"","",{"$f":"IF($A64=\"\",\"\",Listen!$B$3 + SUM($G$6:G64))","v":""}]
[{"$nulls":6},"","",{"$f":"IF($A65=\"\",\"\",Listen!$B$3 + SUM($G$6:G65))","v":""}]
[{"$nulls":6},"","",{"$f":"IF($A66=\"\",\"\",Listen!$B$3 + SUM($G$6:G66))","v":""}]
[{"$nulls":6},"","",{"$f":"IF($A67=\"\",\"\",Listen!$B$3 + SUM($G$6:G67))","v":""}]
[{"$nulls":6},"","",{"$f":"IF($A68=\"\",\"\",Listen!$B$3 + SUM($G$6:G68))","v":""}]
[{"$nulls":6},"","",{"$f":"IF($A69=\"\",\"\",Listen!$B$3 + SUM($G$6:G69))","v":""}]
[{"$nulls":6},{"$f":"IF($A70=\"\",\"\",IF($B70=\"Ausgabe\",-ABS($F70),ABS($F70)))","v":""},{"$f":"IF($A70=\"\",\"\",DATE(YEAR($A70),MONTH($A70),1))","v":""},{"$f":"IF($A70=\"\",\"\",Listen!$B$3 + SUM($G$6:G70))","v":""}]
[{"$nulls":6},"","",{"$f":"IF($A71=\"\",\"\",Listen!$B$3 + SUM($G$6:G71))","v":""}]
[{"$nulls":6},"","",{"$f":"IF($A72=\"\",\"\",Listen!$B$3 + SUM($G$6:G72))","v":""}]
[{"$nulls":6},"","",{"$f":"IF($A73=\"\",\"\",Listen!$B$3 + SUM($G$6:G73))","v":""}]
[{"$nulls":6},"","",{"$f":"IF($A74=\"\",\"\",Listen!$B$3 + SUM($G$6:G74))","v":""}]
[{"$nulls":6},"","",{"$f":"IF($A75=\"\",\"\",Listen!$B$3 + SUM($G$6:G75))","v":""}]
[{"$nulls":6},"","",{"$f":"IF($A76=\"\",\"\",Listen!$B$3 + SUM($G$6:G76))","v":""}]
[{"$nulls":6},"","",{"$f":"IF($A77=\"\",\"\",Listen!$B$3 + SUM($G$6:G77))","v":""}]
[{"$nulls":6},"","",{"$f":"IF($A78=\"\",\"\",Listen!$B$3 + SUM($G$6:G78))","v":""}]
[{"$nulls":6},"","",{"$f":"IF($A79=\"\",\"\",Listen!$B$3 + SUM($G$6:G79))","v":""}]
[{"$nulls":6},"","",{"$f":"IF($A80=\"\",\"\",Listen!$B$3 + SUM($G$6:G80))","v":""}]
[{"$nulls":6},"","",{"$f":"IF($A81=\"\",\"\",Listen!$B$3 + SUM($G$6:G81))","v":""}]
[{"$nulls":6},"","",{"$f":"IF($A82=\"\",\"\",Listen!$B$3 + SUM($G$6:G82))","v":""}]
[{"$nulls":6},"","",{"$f":"IF($A83=\"\",\"\",Listen!$B$3 + SUM($G$6:G83))","v":""}]
[{"$nulls":6},"","",{"$f":"IF($A84=\"\",\"\",Listen!$B$3 + SUM($G$6:G84))","v":""}]
[{"$nulls":6},"","",{"$f":"IF($A85=\"\",\"\",Listen!$B$3 + SUM($G$6:G85))","v":""}]
[{"$nulls":6},"","",{"$f":"IF($A86=\"\",\"\",Listen!$B$3 + SUM($G$6:G86))","v":""}]
[{"$nulls":6},"","",{"$f":"IF($A87=\"\",\"\",Listen!$B$3 + SUM($G$6:G87))","v":""}]
[{"$nulls":6},"","",{"$f":"IF($A88=\"\",\"\",Listen!$B$3 + SUM($G$6:G88))","v":""}]
[{"$nulls":6},"","",{"$f":"IF($A89=\"\",\"\",Listen!$B$3 + SUM($G$6:G89))","v":""}]
[{"$nulls":6},"","",{"$f":"IF($A90=\"\",\"\",Listen!$B$3 + SUM($G$6:G90))","v":""}]
[{"$nulls":6},"","",{"$f":"IF($A91=\"\",\"\",Listen!$B$3 + SUM($G$6:G91))","v":""}]
[{"$nulls":6},"","",{"$f":"IF($A92=\"\",\"\",Listen!$B$3 + SUM($G$6:G92))","v":""}]
[{"$nulls":6},"","",{"$f":"IF($A93=\"\",\"\",Listen!$B$3 + SUM($G$6:G93))","v":""}]
[{"$nulls":6},"","",{"$f":"IF($A94=\"\",\"\",Listen!$B$3 + SUM($G$6:G94))","v":""}]
[{"$nulls":6},"","",{"$f":"IF($A95=\"\",\"\",Listen!$B$3 + SUM($G$6:G95))","v":""}]
[{"$nulls":6},"","",{"$f":"IF($A96=\"\",\"\",Listen!$B$3 + SUM($G$6:G96))","v":""}]
[{"$nulls":6},"","",{"$f":"IF($A97=\"\",\"\",Listen!$B$3 + SUM($G$6:G97))","v":""}]
[{"$nulls":6},"","",{"$f":"IF($A98=\"\",\"\",Listen!$B$3 + SUM($G$6:G98))","v":""}]
[{"$nulls":6},"","",{"$f":"IF($A99=\"\",\"\",Listen!$B$3 + SUM($G$6:G99))","v":""}]
[{"$nulls":6},"","",{"$f":"IF($A100=\"\",\"\",Listen!$B$3 + SUM($G$6:G100))","v":""}]
[{"$nulls":6},"","",{"$f":"IF($A101=\"\",\"\",Listen!$B$3 + SUM($G$6:G101))","v":""}]
[{"$nulls":6},"","",{"$f":"IF($A102=\"\",\"\",Listen!$B$3 + SUM($G$6:G102))","v":""}]
[{"$nulls":6},"","",{"$f":"IF($A103=\"\",\"\",Listen!$B$3 + SUM($G$6:G103))","v":""}]
[{"$nulls":6},"","",{"$f":"IF($A104=\"\",\"\",Listen!$B$3 + SUM($G$6:G104))","v":""}]
[{"$nulls":6},"","",{"$f":"IF($A105=\"\",\"\",Listen!$B$3 + SUM($G$6:G105))","v":""}]
[{"$nulls":6},"","",{"$f":"IF($A106=\"\",\"\",Listen!$B$3 + SUM($G$6:G106))","v":""}]
[{"$nulls":6},"","",{"$f":"IF($A107=\"\",\"\",Listen!$B$3 + SUM($G$6:G107))","v":""}]
[{"$nulls":6},"","",{"$f":"IF($A108=\"\",\"\",Listen!$B$3 + SUM($G$6:G108))","v":""}]
[{"$nulls":6},"","",{"$f":"IF($A109=\"\",\"\",Listen!$B$3 + SUM($G$6:G109))","v":""}]
[{"$nulls":6},"","",{"$f":"IF($A110=\"\",\"\",Listen!$B$3 + SUM($G$6:G110))","v":""}]
[{"$nulls":6},"","",{"$f":"IF($A111=\"\",\"\",Listen!$B$3 + SUM($G$6:G111))","v":""}]
[{"$nulls":6},"","",{"$f":"IF($A112=\"\",\"\",Listen!$B$3 + SUM($G$6:G112))","v":""}]
[{"$nulls":6},"","",{"$f":"IF($A113=\"\",\"\",Listen!$B$3 + SUM($G$6:G113))","v":""}]
[{"$nulls":6},"","",{"$f":"IF($A114=\"\",\"\",Listen!$B$3 + SUM($G$6:G114))","v":""}]
[{"$nulls":6},"","",{"$f":"IF($A115=\"\",\"\",Listen!$B$3 + SUM($G$6:G115))","v":""}]
[{"$nulls":6},"","",{"$f":"IF($A116=\"\",\"\",Listen!$B$3 + SUM($G$6:G116))","v":""}]
[{"$nulls":6},"","",{"$f":"IF($A117=\"\",\"\",Listen!$B$3 + SUM($G$6:G117))","v":""}]
[{"$nulls":6},"","",{"$f":"IF($A118=\"\",\"\",Listen!$B$3 + SUM($G$6:G118))","v":""}]
[{"$nulls":6},"","",{"$f":"IF($A119=\"\",\"\",Listen!$B$3 + SUM($G$6:G119))","v":""}]
[{"$nulls":6},"","",{"$f":"IF($A120=\"\",\"\",Listen!$B$3 + SUM($G$6:G120))","v":""}]
[{"$nulls":6},"","",{"$f":"IF($A121=\"\",\"\",Listen!$B$3 + SUM($G$6:G121))","v":""}]
[{"$nulls":6},"","",{"$f":"IF($A122=\"\",\"\",Listen!$B$3 + SUM($G$6:G122))","v":""}]
[{"$nulls":6},"","",{"$f":"IF($A123=\"\",\"\",Listen!$B$3 + SUM($G$6:G123))","v":""}]
[{"$nulls":6},"","",{"$f":"IF($A124=\"\",\"\",Listen!$B$3 + SUM($G$6:G124))","v":""}]
[{"$nulls":6},"","",{"$f":"IF($A125=\"\",\"\",Listen!$B$3 + SUM($G$6:G125))","v":""}]
[{"$nulls":6},"","",{"$f":"IF($A126=\"\",\"\",Listen!$B$3 + SUM($G$6:G126))","v":""}]
[{"$nulls":6},"","",{"$f":"IF($A127=\"\",\"\",Listen!$B$3 + SUM($G$6:G127))","v":""}]
[{"$nulls":6},"","",{"$f":"IF($A128=\"\",\"\",Listen!$B$3 + SUM($G$6:G128))","v":""}]
[{"$nulls":6},"","",{"$f":"IF($A129=\"\",\"\",Listen!$B$3 + SUM($G$6:G129))","v":""}]
[{"$nulls":6},"","",{"$f":"IF($A130=\"\",\"\",Listen!$B$3 + SUM($G$6:G130))","v":""}]
[{"$nulls":6},"","",{"$f":"IF($A131=\"\",\"\",Listen!$B$3 + SUM($G$6:G131))","v":""}]
[{"$nulls":6},"","",{"$f":"IF($A132=\"\",\"\",Listen!$B$3 + SUM($G$6:G132))","v":""}]
[{"$nulls":6},"","",{"$f":"IF($A133=\"\",\"\",Listen!$B$3 + SUM($G$6:G133))","v":""}]
[{"$nulls":6},{"$f":"IF($A134=\"\",\"\",IF($B134=\"Ausgabe\",-ABS($F134),ABS($F134)))","v":""},{"$f":"IF($A134=\"\",\"\",DATE(YEAR($A134),MONTH($A134),1))","v":""},{"$f":"IF($A134=\"\",\"\",Listen!$B$3 + SUM($G$6:G134))","v":""}]
[{"$nulls":6},"","",{"$f":"IF($A135=\"\",\"\",Listen!$B$3 + SUM($G$6:G135))","v":""}]
[{"$nulls":6},"","",{"$f":"IF($A136=\"\",\"\",Listen!$B$3 + SUM($G$6:G136))","v":""}]
[{"$nulls":6},"","",{"$f":"IF($A137=\"\",\"\",Listen!$B$3 + SUM($G$6:G137))","v":""}]
[{"$nulls":6},"","",{"$f":"IF($A138=\"\",\"\",Listen!$B$3 + SUM($G$6:G138))","v":""}]
[{"$nulls":6},"","",{"$f":"IF($A139=\"\",\"\",Listen!$B$3 + SUM($G$6:G139))","v":""}]
[{"$nulls":6},"","",{"$f":"IF($A140=\"\",\"\",Listen!$B$3 + SUM($G$6:G140))","v":""}]
[{"$nulls":6},"","",{"$f":"IF($A141=\"\",\"\",Listen!$B$3 + SUM($G$6:G141))","v":""}]
[{"$nulls":6},"","",{"$f":"IF($A142=\"\",\"\",Listen!$B$3 + SUM($G$6:G142))","v":""}]
[{"$nulls":6},"","",{"$f":"IF($A143=\"\",\"\",Listen!$B$3 + SUM($G$6:G143))","v":""}]
[{"$nulls":6},"","",{"$f":"IF($A144=\"\",\"\",Listen!$B$3 + SUM($G$6:G144))","v":""}]
[{"$nulls":6},"","",{"$f":"IF($A145=\"\",\"\",Listen!$B$3 + SUM($G$6:G145))","v":""}]
[{"$nulls":6},"","",{"$f":"IF($A146=\"\",\"\",Listen!$B$3 + SUM($G$6:G146))","v":""}]
[{"$nulls":6},"","",{"$f":"IF($A147=\"\",\"\",Listen!$B$3 + SUM($G$6:G147))","v":""}]
[{"$nulls":6},"","",{"$f":"IF($A148=\"\",\"\",Listen!$B$3 + SUM($G$6:G148))","v":""}]
[{"$nulls":6},"","",{"$f":"IF($A149=\"\",\"\",Listen!$B$3 + SUM($G$6:G149))","v":""}]
[{"$nulls":6},"","",{"$f":"IF($A150=\"\",\"\",Listen!$B$3 + SUM($G$6:G150))","v":""}]
[{"$nulls":6},"","",{"$f":"IF($A151=\"\",\"\",Listen!$B$3 + SUM($G$6:G151))","v":""}]
[{"$nulls":6},"","",{"$f":"IF($A152=\"\",\"\",Listen!$B$3 + SUM($G$6:G152))","v":""}]
[{"$nulls":6},"","",{"$f":"IF($A153=\"\",\"\",Listen!$B$3 + SUM($G$6:G153))","v":""}]
[{"$nulls":6},"","",{"$f":"IF($A154=\"\",\"\",Listen!$B$3 + SUM($G$6:G154))","v":""}]
[{"$nulls":6},"","",{"$f":"IF($A155=\"\",\"\",Listen!$B$3 + SUM($G$6:G155))","v":""}]
[{"$nulls":6},"","",{"$f":"IF($A156=\"\",\"\",Listen!$B$3 + SUM($G$6:G156))","v":""}]
[{"$nulls":6},"","",{"$f":"IF($A157=\"\",\"\",Listen!$B$3 + SUM($G$6:G157))","v":""}]
[{"$nulls":6},"","",{"$f":"IF($A158=\"\",\"\",Listen!$B$3 + SUM($G$6:G158))","v":""}]
[{"$nulls":6},"","",{"$f":"IF($A159=\"\",\"\",Listen!$B$3 + SUM($G$6:G159))","v":""}]
[{"$nulls":6},"","",{"$f":"IF($A160=\"\",\"\",Listen!$B$3 + SUM($G$6:G160))","v":""}]
[{"$nulls":6},"","",{"$f":"IF($A161=\"\",\"\",Listen!$B$3 + SUM($G$6:G161))","v":""}]
[{"$nulls":6},"","",{"$f":"IF($A162=\"\",\"\",Listen!$B$3 + SUM($G$6:G162))","v":""}]
[{"$nulls":6},"","",{"$f":"IF($A163=\"\",\"\",Listen!$B$3 + SUM($G$6:G163))","v":""}]
[{"$nulls":6},"","",{"$f":"IF($A164=\"\",\"\",Listen!$B$3 + SUM($G$6:G164))","v":""}]
[{"$nulls":6},"","",{"$f":"IF($A165=\"\",\"\",Listen!$B$3 + SUM($G$6:G165))","v":""}]
[{"$nulls":6},"","",{"$f":"IF($A166=\"\",\"\",Listen!$B$3 + SUM($G$6:G166))","v":""}]
[{"$nulls":6},"","",{"$f":"IF($A167=\"\",\"\",Listen!$B$3 + SUM($G$6:G167))","v":""}]
[{"$nulls":6},"","",{"$f":"IF($A168=\"\",\"\",Listen!$B$3 + SUM($G$6:G168))","v":""}]
[{"$nulls":6},"","",{"$f":"IF($A169=\"\",\"\",Listen!$B$3 + SUM($G$6:G169))","v":""}]
[{"$nulls":6},"","",{"$f":"IF($A170=\"\",\"\",Listen!$B$3 + SUM($G$6:G170))","v":""}]
[{"$nulls":6},"","",{"$f":"IF($A171=\"\",\"\",Listen!$B$3 + SUM($G$6:G171))","v":""}]
[{"$nulls":6},"","",{"$f":"IF($A172=\"\",\"\",Listen!$B$3 + SUM($G$6:G172))","v":""}]
[{"$nulls":6},"","",{"$f":"IF($A173=\"\",\"\",Listen!$B$3 + SUM($G$6:G173))","v":""}]
[{"$nulls":6},"","",{"$f":"IF($A174=\"\",\"\",Listen!$B$3 + SUM($G$6:G174))","v":""}]
[{"$nulls":6},"","",{"$f":"IF($A175=\"\",\"\",Listen!$B$3 + SUM($G$6:G175))","v":""}]
[{"$nulls":6},"","",{"$f":"IF($A176=\"\",\"\",Listen!$B$3 + SUM($G$6:G176))","v":""}]
[{"$nulls":6},"","",{"$f":"IF($A177=\"\",\"\",Listen!$B$3 + SUM($G$6:G177))","v":""}]
[{"$nulls":6},"","",{"$f":"IF($A178=\"\",\"\",Listen!$B$3 + SUM($G$6:G178))","v":""}]
[{"$nulls":6},"","",{"$f":"IF($A179=\"\",\"\",Listen!$B$3 + SUM($G$6:G179))","v":""}]
[{"$nulls":6},"","",{"$f":"IF($A180=\"\",\"\",Listen!$B$3 + SUM($G$6:G180))","v":""}]
[{"$nulls":6},"","",{"$f":"IF($A181=\"\",\"\",Listen!$B$3 + SUM($G$6:G181))","v":""}]
[{"$nulls":6},"","",{"$f":"IF($A182=\"\",\"\",Listen!$B$3 + SUM($G$6:G182))","v":""}]
[{"$nulls":6},"","",{"$f":"IF($A183=\"\",\"\",Listen!$B$3 + SUM($G$6:G183))","v":""}]
[{"$nulls":6},"","",{"$f":"IF($A184=\"\",\"\",Listen!$B$3 + SUM($G$6:G184))","v":""}]
[{"$nulls":6},"","",{"$f":"IF($A185=\"\",\"\",Listen!$B$3 + SUM($G$6:G185))","v":""}]
[{"$nulls":6},"","",{"$f":"IF($A186=\"\",\"\",Listen!$B$3 + SUM($G$6:G186))","v":""}]
[{"$nulls":6},"","",{"$f":"IF($A187=\"\",\"\",Listen!$B$3 + SUM($G$6:G187))","v":""}]
[{"$nulls":6},"","",{"$f":"IF($A188=\"\",\"\",Listen!$B$3 + SUM($G$6:G188))","v":""}]
[{"$nulls":6},"","",{"$f":"IF($A189=\"\",\"\",Listen!$B$3 + SUM($G$6:G189))","v":""}]
[{"$nulls":6},"","",{"$f":"IF($A190=\"\",\"\",Listen!$B$3 + SUM($G$6:G190))","v":""}]
[{"$nulls":6},"","",{"$f":"IF($A191=\"\",\"\",Listen!$B$3 + SUM($G$6:G191))","v":""}]
[{"$nulls":6},"","",{"$f":"IF($A192=\"\",\"\",Listen!$B$3 + SUM($G$6:G192))","v":""}]
[{"$nulls":6},"","",{"$f":"IF($A193=\"\",\"\",Listen!$B$3 + SUM($G$6:G193))","v":""}]
[{"$nulls":6},"","",{"$f":"IF($A194=\"\",\"\",Listen!$B$3 + SUM($G$6:G194))","v":""}]
[{"$nulls":6},"","",{"$f":"IF($A195=\"\",\"\",Listen!$B$3 + SUM($G$6:G195))","v":""}]
[{"$nulls":6},"","",{"$f":"IF($A196=\"\",\"\",Listen!$B$3 + SUM($G$6:G196))","v":""}]
[{"$nulls":6},"","",{"$f":"IF($A197=\"\",\"\",Listen!$B$3 + SUM($G$6:G197))","v":""}]
[{"$nulls":6},{"$f":"IF($A198=\"\",\"\",IF($B198=\"Ausgabe\",-ABS($F198),ABS($F198)))","v":""},{"$f":"IF($A198=\"\",\"\",DATE(YEAR($A198),MONTH($A198),1))","v":""},{"$f":"IF($A198=\"\",\"\",Listen!$B$3 + SUM($G$6:G198))","v":""}]
[{"$nulls":6},"","",{"$f":"IF($A199=\"\",\"\",Listen!$B$3 + SUM($G$6:G199))","v":""}]
[{"$nulls":6},"","",{"$f":"IF($A200=\"\",\"\",Listen!$B$3 + SUM($G$6:G200))","v":""}]
{"$rows_left_out":306}
{"sheet":"Übersicht","index":1,"n_rows":24,"n_cols":4,"rows_kept":24}
["Übersicht (Monat)"]
[]
["Monat","2026-01-01"]
["Jahr",{"$f":"Listen!$B$2","v":2026}]
[]
["Einnahmen (Monat)",{"$f":"SUMIFS(Bewegungen!$G$6:$G$505,Bewegungen!$B$6:$B$505,\"Einnahme\",Bewegungen!$H$6:$H$505,$B$3)","v":{"v":3000,"d":"€ 3,000.00"}}]
["Ausgaben (Monat)",{"$f":"ABS(SUMIFS(Bewegungen!$G$6:$G$505,Bewegungen!$B$6:$B$505,\"Ausgabe\",Bewegungen!$H$6:$H$505,$B$3))","v":{"v":1085.89,"d":"€ 1,085.89"}}]
["Netto (Monat)",{"$f":"B6-B7","v":{"v":1914.11,"d":"€ 1,914.11"}}]
[]
["Ausgaben nach Kategorie (Monat)"]
[]
["Kategorie","Budget (€)","Ist (€)","Differenz (€)"]
["Miete / Wohnen",{"v":900,"d":"€ 900.00"},{"$f":"ABS(SUMIFS(Bewegungen!$G$6:$G$505,Bewegungen!$B$6:$B$505,\"Ausgabe\",Bewegungen!$C$6:$C$505,$A13,Bewegungen!$H$6:$H$505,$B$3))","v":{"v":900,"d":"€ 900.00"}},{"$f":"$B13-$C13","v":{"v":0,"d":"€ 0.00"}}]
["Nebenkosten",{"v":180,"d":"€ 180.00"},{"$f":"ABS(SUMIFS(Bewegungen!$G$6:$G$505,Bewegungen!$B$6:$B$505,\"Ausgabe\",Bewegungen!$C$6:$C$505,$A14,Bewegungen!$H$6:$H$505,$B$3))","v":{"v":0,"d":"€ 0.00"}},{"v":180,"d":"€ 180.00"}]
["Lebensmittel",{"v":350,"d":"€ 350.00"},{"$f":"ABS(SUMIFS(Bewegungen!$G$6:$G$505,Bewegungen!$B$6:$B$505,\"Ausgabe\",Bewegungen!$C$6:$C$505,$A15,Bewegungen!$H$6:$H$505,$B$3))","v":{"v":85.4,"d":"€ 85.40"}},{"v":264.6,"d":"€ 264.60"}]
["Transport",{"v":120,"d":"€ 120.00"},{"$f":"ABS(SUMIFS(Bewegungen!$G$6:$G$505,Bewegungen!$B$6:$B$505,\"Ausgabe\",Bewegungen!$C$6:$C$505,$A16,Bewegungen!$H$6:$H$505,$B$3))","v":{"v":49,"d":"€ 49.00"}},{"v":71,"d":"€ 71.00"}]
["Gesundheit",{"v":60,"d":"€ 60.00"},{"$f":"ABS(SUMIFS(Bewegungen!$G$6:$G$505,Bewegungen!$B$6:$B$505,\"Ausgabe\",Bewegungen!$C$6:$C$505,$A17,Bewegungen!$H$6:$H$505,$B$3))","v":{"v":0,"d":"€ 0.00"}},{"v":60,"d":"€ 60.00"}]
["Freizeit",{"v":120,"d":"€ 120.00"},{"$f":"ABS(SUMIFS(Bewegungen!$G$6:$G$505,Bewegungen!$B$6:$B$505,\"Ausgabe\",Bewegungen!$C$6:$C$505,$A18,Bewegungen!$H$6:$H$505,$B$3))","v":{"v":38.5,"d":"€ 38.50"}},{"v":81.5,"d":"€ 81.50"}]
["Bildung",{"v":40,"d":"€ 40.00"},{"$f":"ABS(SUMIFS(Bewegungen!$G$6:$G$505,Bewegungen!$B$6:$B$505,\"Ausgabe\",Bewegungen!$C$6:$C$505,$A19,Bewegungen!$H$6:$H$505,$B$3))","v":{"v":0,"d":"€ 0.00"}},{"v":40,"d":"€ 40.00"}]
["Versicherungen",{"v":90,"d":"€ 90.00"},{"$f":"ABS(SUMIFS(Bewegungen!$G$6:$G$505,Bewegungen!$B$6:$B$505,\"Ausgabe\",Bewegungen!$C$6:$C$505,$A20,Bewegungen!$H$6:$H$505,$B$3))","v":{"v":0,"d":"€ 0.00"}},{"v":90,"d":"€ 90.00"}]
["Abonnements",{"v":35,"d":"€ 35.00"},{"$f":"ABS(SUMIFS(Bewegungen!$G$6:$G$505,Bewegungen!$B$6:$B$505,\"Ausgabe\",Bewegungen!$C$6:$C$505,$A21,Bewegungen!$H$6:$H$505,$B$3))","v":{"v":12.99,"d":"€ 12.99"}},{"v":22.009999999999998,"d":"€ 22.01"}]
["Kleidung",{"v":60,"d":"€ 60.00"},{"$f":"ABS(SUMIFS(Bewegungen!$G$6:$G$505,Bewegungen!$B$6:$B$505,\"Ausgabe\",Bewegungen!$C$6:$C$505,$A22,Bewegungen!$H$6:$H$505,$B$3))","v":{"v":0,"d":"€ 0.00"}},{"v":60,"d":"€ 60.00"}]
["Steuern / Gebühren",{"v":50,"d":"€ 50.00"},{"$f":"ABS(SUMIFS(Bewegungen!$G$6:$G$505,Bewegungen!$B$6:$B$505,\"Ausgabe\",Bewegungen!$C$6:$C$505,$A23,Bewegungen!$H$6:$H$505,$B$3))","v":{"v":0,"d":"€ 0.00"}},{"v":50,"d":"€ 50.00"}]
["Sonstiges",{"v":75,"d":"€ 75.00"},{"$f":"ABS(SUMIFS(Bewegungen!$G$6:$G$505,Bewegungen!$B$6:$B$505,\"Ausgabe\",Bewegungen!$C$6:$C$505,$A24,Bewegungen!$H$6:$H$505,$B$3))","v":{"v":0,"d":"€ 0.00"}},{"v":75,"d":"€ 75.00"}]

{"sheet":"Listen","index":2,"n_rows":47,"n_cols":3,"rows_kept":47}
["Parameter"]
["Jahr",2026]
["Startsaldo",{"v":1000,"d":"€ 1,000.00"}]
[]
[]
["Typ","Kategorie","Monatsbudget (€)"]
["Ausgabe","Miete / Wohnen",{"v":900,"d":"€ 900.00"}]
["Ausgabe","Nebenkosten",{"v":180,"d":"€ 180.00"}]
["Ausgabe","Lebensmittel",{"v":350,"d":"€ 350.00"}]
["Ausgabe","Transport",{"v":120,"d":"€ 120.00"}]
["Ausgabe","Gesundheit",{"v":60,"d":"€ 60.00"}]
["Ausgabe","Freizeit",{"v":120,"d":"€ 120.00"}]
["Ausgabe","Bildung",{"v":40,"d":"€ 40.00"}]
["Ausgabe","Versicherungen",{"v":90,"d":"€ 90.00"}]
["Ausgabe","Abonnements",{"v":35,"d":"€ 35.00"}]
["Ausgabe","Kleidung",{"v":60,"d":"€ 60.00"}]
["Ausgabe","Steuern / Gebühren",{"v":50,"d":"€ 50.00"}]
["Ausgabe","Sonstiges",{"v":75,"d":"€ 75.00"}]
["Einnahme","Gehalt",{"v":0,"d":"€ 0.00"}]
["Einnahme","Bonus",{"v":0,"d":"€ 0.00"}]
["Einnahme","Freelance",{"v":0,"d":"€ 0.00"}]
["Einnahme","Rückerstattung",{"v":0,"d":"€ 0.00"}]
["Einnahme","Zinsen",{"v":0,"d":"€ 0.00"}]
["Einnahme","Sonstige Einnahmen",{"v":0,"d":"€ 0.00"}]
[]
[]
["Konten"]
["Konto"]
["Bargeld"]
["Bank"]
["Karte"]
[]
[]
["Monate (für Auswahl)"]
["Monat (1. Tag)"]
["2026-01-01"]
["2026-02-01"]
["2026-03-01"]
["2026-04-01"]
["2026-05-01"]
["2026-06-01"]
["2026-07-01"]
["2026-08-01"]
["2026-09-01"]
["2026-10-01"]
["2026-11-01"]
["2026-12-01"]