{"text_format":"3","workbook":"xlsx","n_sheets":3,"sheets":["Mietübersicht","Zahlungen","Ausgaben"],"read":"whole","date_system":"1900"}

{"sheet":"Mietübersicht","index":0,"n_rows":209,"n_cols":13,"rows_kept":209,"merged":[[0,0,0,12]]}
["Hausverwaltung – Mietübersicht"]
[]
["Monat (1. Tag)",{"$f":"DATE(YEAR(TODAY()),MONTH(TODAY()),1)","v":"2026-02-01"},"Ändere den Monat, um Einnahmen/Ausgaben und Status zu aktualisieren.",{"$nulls":4},"Soll-Warmmiete\n(Monat)",{"$f":"SUMIFS($F$10:$F$209,$L$10:$L$209,\"Ja\")","v":{"v":4410,"d":"4,410.00 €"}}]
[{"$nulls":7},"Ist-Einnahmen\n(Monat)",{"$f":"SUMIFS($I$10:$I$209,$L$10:$L$209,\"Ja\")","v":{"v":3200,"d":"3,200.00 €"}}]
[{"$nulls":7},"Offen (Monat)",{"$f":"MAX(0,I3-I4)","v":{"v":1210,"d":"1,210.00 €"}}]
[{"$nulls":7},"Ausgaben (Monat)",{"$f":"SUMIFS(Ausgaben!$F$6:$F$205,Ausgaben!$B$6:$B$205,$B$3)","v":{"v":360,"d":"360.00 €"}}]
[{"$nulls":7},"Cashflow (Monat)",{"$f":"I4-I6","v":{"v":2840,"d":"2,840.00 €"}}]
[]
["Objekt-ID","Objekt/Einheit","Mieter","Kaltmiete\n(€)","Nebenkosten (€)","Warmmiete\n(€)","Fälligkeit\n(Tag)","Fälligkeit\n(Monat)","Eingang\n(Monat)","Rest (Monat)","Status (Monat)","Aktiv?","Notizen"]
["W-001","Wohnung 1","Anna Müller",{"v":750,"d":"750.00 €"},{"v":200,"d":"200.00 €"},{"$f":"IF($A10=\"\",\"\",D10+E10)","v":{"v":950,"d":"950.00 €"}},3,{"$f":"IF($A10=\"\",\"\",DATE(YEAR($B$3),MONTH($B$3),G10))","v":"2026-02-03"},{"$f":"IF($A10=\"\",\"\",SUMIFS(Zahlungen!$G$6:$G$205,Zahlungen!$B$6:$B$205,$B$3,Zahlungen!$C$6:$C$205,$A10,Zahlungen!$F$6:$F$205,\"Warmmiete\"))","v":{"v":950,"d":"950.00 €"}},{"$f":"IF($A10=\"\",\"\",MAX(0,F10-I10))","v":{"v":0,"d":"0.00 €"}},{"$f":"IF($A10=\"\",\"\",IF(J10=0,\"Bezahlt\",IF(I10=0,\"Offen\",\"Teilweise\")))","v":"Bezahlt"},"Ja"]
["W-002","Wohnung 2","Ben Schneider",{"v":820,"d":"820.00 €"},{"v":220,"d":"220.00 €"},{"v":1040,"d":"1,040.00 €"},3,"2026-02-03",{"$f":"IF($A11=\"\",\"\",SUMIFS(Zahlungen!$G$6:$G$205,Zahlungen!$B$6:$B$205,$B$3,Zahlungen!$C$6:$C$205,$A11,Zahlungen!$F$6:$F$205,\"Warmmiete\"))","v":{"v":700,"d":"700.00 €"}},{"v":340,"d":"340.00 €"},"Teilweise","Ja"]
["W-003","Wohnung 3","Carla Wagner",{"v":680,"d":"680.00 €"},{"v":190,"d":"190.00 €"},{"v":870,"d":"870.00 €"},5,"2026-02-05",{"$f":"IF($A12=\"\",\"\",SUMIFS(Zahlungen!$G$6:$G$205,Zahlungen!$B$6:$B$205,$B$3,Zahlungen!$C$6:$C$205,$A12,Zahlungen!$F$6:$F$205,\"Warmmiete\"))","v":{"v":0,"d":"0.00 €"}},{"v":870,"d":"870.00 €"},"Offen","Ja"]
["G-001","Gewerbe 1","Bäckerei Kruse GmbH",{"v":1200,"d":"1,200.00 €"},{"v":350,"d":"350.00 €"},{"v":1550,"d":"1,550.00 €"},1,"2026-02-01",{"$f":"IF($A13=\"\",\"\",SUMIFS(Zahlungen!$G$6:$G$205,Zahlungen!$B$6:$B$205,$B$3,Zahlungen!$C$6:$C$205,$A13,Zahlungen!$F$6:$F$205,\"Warmmiete\"))","v":{"v":1550,"d":"1,550.00 €"}},{"v":0,"d":"0.00 €"},"Bezahlt","Ja"]
["W-004","Wohnung 4","Daniel Fischer",{"v":900,"d":"900.00 €"},{"v":250,"d":"250.00 €"},{"v":1150,"d":"1,150.00 €"},5,"2026-02-05",{"$f":"IF($A14=\"\",\"\",SUMIFS(Zahlungen!$G$6:$G$205,Zahlungen!$B$6:$B$205,$B$3,Zahlungen!$C$6:$C$205,$A14,Zahlungen!$F$6:$F$205,\"Warmmiete\"))","v":{"v":0,"d":"0.00 €"}},{"v":1150,"d":"1,150.00 €"},"Offen","Nein","Leerstand"]
[{"$nulls":5},"",null,"",{"$f":"IF($A15=\"\",\"\",SUMIFS(Zahlungen!$G$6:$G$205,Zahlungen!$B$6:$B$205,$B$3,Zahlungen!$C$6:$C$205,$A15,Zahlungen!$F$6:$F$205,\"Warmmiete\"))","v":""},"",""]
[{"$nulls":5},"",null,"",{"$f":"IF($A16=\"\",\"\",SUMIFS(Zahlungen!$G$6:$G$205,Zahlungen!$B$6:$B$205,$B$3,Zahlungen!$C$6:$C$205,$A16,Zahlungen!$F$6:$F$205,\"Warmmiete\"))","v":""},"",""]
[{"$nulls":5},"",null,"",{"$f":"IF($A17=\"\",\"\",SUMIFS(Zahlungen!$G$6:$G$205,Zahlungen!$B$6:$B$205,$B$3,Zahlungen!$C$6:$C$205,$A17,Zahlungen!$F$6:$F$205,\"Warmmiete\"))","v":""},"",""]
[{"$nulls":5},"",null,"",{"$f":"IF($A18=\"\",\"\",SUMIFS(Zahlungen!$G$6:$G$205,Zahlungen!$B$6:$B$205,$B$3,Zahlungen!$C$6:$C$205,$A18,Zahlungen!$F$6:$F$205,\"Warmmiete\"))","v":""},"",""]
[{"$nulls":5},"",null,"",{"$f":"IF($A19=\"\",\"\",SUMIFS(Zahlungen!$G$6:$G$205,Zahlungen!$B$6:$B$205,$B$3,Zahlungen!$C$6:$C$205,$A19,Zahlungen!$F$6:$F$205,\"Warmmiete\"))","v":""},"",""]
[{"$nulls":5},"",null,"",{"$f":"IF($A20=\"\",\"\",SUMIFS(Zahlungen!$G$6:$G$205,Zahlungen!$B$6:$B$205,$B$3,Zahlungen!$C$6:$C$205,$A20,Zahlungen!$F$6:$F$205,\"Warmmiete\"))","v":""},"",""]
[{"$nulls":5},"",null,"",{"$f":"IF($A21=\"\",\"\",SUMIFS(Zahlungen!$G$6:$G$205,Zahlungen!$B$6:$B$205,$B$3,Zahlungen!$C$6:$C$205,$A21,Zahlungen!$F$6:$F$205,\"Warmmiete\"))","v":""},"",""]
[{"$nulls":5},"",null,"",{"$f":"IF($A22=\"\",\"\",SUMIFS(Zahlungen!$G$6:$G$205,Zahlungen!$B$6:$B$205,$B$3,Zahlungen!$C$6:$C$205,$A22,Zahlungen!$F$6:$F$205,\"Warmmiete\"))","v":""},"",""]
[{"$nulls":5},"",null,"",{"$f":"IF($A23=\"\",\"\",SUMIFS(Zahlungen!$G$6:$G$205,Zahlungen!$B$6:$B$205,$B$3,Zahlungen!$C$6:$C$205,$A23,Zahlungen!$F$6:$F$205,\"Warmmiete\"))","v":""},"",""]
[{"$nulls":5},"",null,"",{"$f":"IF($A24=\"\",\"\",SUMIFS(Zahlungen!$G$6:$G$205,Zahlungen!$B$6:$B$205,$B$3,Zahlungen!$C$6:$C$205,$A24,Zahlungen!$F$6:$F$205,\"Warmmiete\"))","v":""},"",""]
[{"$nulls":5},"",null,"",{"$f":"IF($A25=\"\",\"\",SUMIFS(Zahlungen!$G$6:$G$205,Zahlungen!$B$6:$B$205,$B$3,Zahlungen!$C$6:$C$205,$A25,Zahlungen!$F$6:$F$205,\"Warmmiete\"))","v":""},"",""]
[{"$nulls":5},"",null,"",{"$f":"IF($A26=\"\",\"\",SUMIFS(Zahlungen!$G$6:$G$205,Zahlungen!$B$6:$B$205,$B$3,Zahlungen!$C$6:$C$205,$A26,Zahlungen!$F$6:$F$205,\"Warmmiete\"))","v":""},"",""]
[{"$nulls":5},"",null,"",{"$f":"IF($A27=\"\",\"\",SUMIFS(Zahlungen!$G$6:$G$205,Zahlungen!$B$6:$B$205,$B$3,Zahlungen!$C$6:$C$205,$A27,Zahlungen!$F$6:$F$205,\"Warmmiete\"))","v":""},"",""]
[{"$nulls":5},"",null,"",{"$f":"IF($A28=\"\",\"\",SUMIFS(Zahlungen!$G$6:$G$205,Zahlungen!$B$6:$B$205,$B$3,Zahlungen!$C$6:$C$205,$A28,Zahlungen!$F$6:$F$205,\"Warmmiete\"))","v":""},"",""]
[{"$nulls":5},"",null,"",{"$f":"IF($A29=\"\",\"\",SUMIFS(Zahlungen!$G$6:$G$205,Zahlungen!$B$6:$B$205,$B$3,Zahlungen!$C$6:$C$205,$A29,Zahlungen!$F$6:$F$205,\"Warmmiete\"))","v":""},"",""]
[{"$nulls":5},"",null,"",{"$f":"IF($A30=\"\",\"\",SUMIFS(Zahlungen!$G$6:$G$205,Zahlungen!$B$6:$B$205,$B$3,Zahlungen!$C$6:$C$205,$A30,Zahlungen!$F$6:$F$205,\"Warmmiete\"))","v":""},"",""]
[{"$nulls":5},"",null,"",{"$f":"IF($A31=\"\",\"\",SUMIFS(Zahlungen!$G$6:$G$205,Zahlungen!$B$6:$B$205,$B$3,Zahlungen!$C$6:$C$205,$A31,Zahlungen!$F$6:$F$205,\"Warmmiete\"))","v":""},"",""]
[{"$nulls":5},"",null,"",{"$f":"IF($A32=\"\",\"\",SUMIFS(Zahlungen!$G$6:$G$205,Zahlungen!$B$6:$B$205,$B$3,Zahlungen!$C$6:$C$205,$A32,Zahlungen!$F$6:$F$205,\"Warmmiete\"))","v":""},"",""]
[{"$nulls":5},"",null,"",{"$f":"IF($A33=\"\",\"\",SUMIFS(Zahlungen!$G$6:$G$205,Zahlungen!$B$6:$B$205,$B$3,Zahlungen!$C$6:$C$205,$A33,Zahlungen!$F$6:$F$205,\"Warmmiete\"))","v":""},"",""]
[{"$nulls":5},"",null,"",{"$f":"IF($A34=\"\",\"\",SUMIFS(Zahlungen!$G$6:$G$205,Zahlungen!$B$6:$B$205,$B$3,Zahlungen!$C$6:$C$205,$A34,Zahlungen!$F$6:$F$205,\"Warmmiete\"))","v":""},"",""]
[{"$nulls":5},"",null,"",{"$f":"IF($A35=\"\",\"\",SUMIFS(Zahlungen!$G$6:$G$205,Zahlungen!$B$6:$B$205,$B$3,Zahlungen!$C$6:$C$205,$A35,Zahlungen!$F$6:$F$205,\"Warmmiete\"))","v":""},"",""]
[{"$nulls":5},"",null,"",{"$f":"IF($A36=\"\",\"\",SUMIFS(Zahlungen!$G$6:$G$205,Zahlungen!$B$6:$B$205,$B$3,Zahlungen!$C$6:$C$205,$A36,Zahlungen!$F$6:$F$205,\"Warmmiete\"))","v":""},"",""]
[{"$nulls":5},"",null,"",{"$f":"IF($A37=\"\",\"\",SUMIFS(Zahlungen!$G$6:$G$205,Zahlungen!$B$6:$B$205,$B$3,Zahlungen!$C$6:$C$205,$A37,Zahlungen!$F$6:$F$205,\"Warmmiete\"))","v":""},"",""]
[{"$nulls":5},"",null,"",{"$f":"IF($A38=\"\",\"\",SUMIFS(Zahlungen!$G$6:$G$205,Zahlungen!$B$6:$B$205,$B$3,Zahlungen!$C$6:$C$205,$A38,Zahlungen!$F$6:$F$205,\"Warmmiete\"))","v":""},"",""]
[{"$nulls":5},"",null,"",{"$f":"IF($A39=\"\",\"\",SUMIFS(Zahlungen!$G$6:$G$205,Zahlungen!$B$6:$B$205,$B$3,Zahlungen!$C$6:$C$205,$A39,Zahlungen!$F$6:$F$205,\"Warmmiete\"))","v":""},"",""]
[{"$nulls":5},"",null,"",{"$f":"IF($A40=\"\",\"\",SUMIFS(Zahlungen!$G$6:$G$205,Zahlungen!$B$6:$B$205,$B$3,Zahlungen!$C$6:$C$205,$A40,Zahlungen!$F$6:$F$205,\"Warmmiete\"))","v":""},"",""]
{"$rows_left_out":170}
{"sheet":"Zahlungen","index":1,"n_rows":205,"n_cols":9,"rows_kept":205,"merged":[[0,0,0,8]]}
["Zahlungen – Einnahmen"]
[]
[]
[]
["Datum","Monat","Objekt-ID","Objekt/Einheit","Mieter","Kategorie","Betrag (€)","Zahlungsart","Referenz/Notiz"]
[{"$f":"Mietübersicht!$B$3","v":"2026-02-01"},{"$f":"IF(A6=\"\",\"\",DATE(YEAR(A6),MONTH(A6),1))","v":"2026-02-01"},"G-001",{"$f":"IF($C6=\"\",\"\",IFERROR(INDEX(Mietübersicht!$B$10:$B$209,MATCH($C6,Mietübersicht!$A$10:$A$209,0)),\"\"))","v":"Gewerbe 1"},{"$f":"IF($C6=\"\",\"\",IFERROR(INDEX(Mietübersicht!$C$10:$C$209,MATCH($C6,Mietübersicht!$A$10:$A$209,0)),\"\"))","v":"Bäckerei Kruse GmbH"},"Warmmiete",{"v":1550,"d":"1,550.00 €"},"Überweisung","Feb Warmmiete"]
[{"$f":"Mietübersicht!$B$3+1","v":"2026-02-02"},"2026-02-01","W-001",{"$f":"IF($C7=\"\",\"\",IFERROR(INDEX(Mietübersicht!$B$10:$B$209,MATCH($C7,Mietübersicht!$A$10:$A$209,0)),\"\"))","v":"Wohnung 1"},{"$f":"IF($C7=\"\",\"\",IFERROR(INDEX(Mietübersicht!$C$10:$C$209,MATCH($C7,Mietübersicht!$A$10:$A$209,0)),\"\"))","v":"Anna Müller"},"Kaution",{"v":1900,"d":"1,900.00 €"},"Überweisung","Kaution"]
[{"$f":"Mietübersicht!$B$3+2","v":"2026-02-03"},"2026-02-01","W-001",{"$f":"IF($C8=\"\",\"\",IFERROR(INDEX(Mietübersicht!$B$10:$B$209,MATCH($C8,Mietübersicht!$A$10:$A$209,0)),\"\"))","v":"Wohnung 1"},{"$f":"IF($C8=\"\",\"\",IFERROR(INDEX(Mietübersicht!$C$10:$C$209,MATCH($C8,Mietübersicht!$A$10:$A$209,0)),\"\"))","v":"Anna Müller"},"Warmmiete",{"v":950,"d":"950.00 €"},"Lastschrift","Feb Warmmiete"]
[{"$f":"Mietübersicht!$B$3+3","v":"2026-02-04"},"2026-02-01","W-002",{"$f":"IF($C9=\"\",\"\",IFERROR(INDEX(Mietübersicht!$B$10:$B$209,MATCH($C9,Mietübersicht!$A$10:$A$209,0)),\"\"))","v":"Wohnung 2"},{"$f":"IF($C9=\"\",\"\",IFERROR(INDEX(Mietübersicht!$C$10:$C$209,MATCH($C9,Mietübersicht!$A$10:$A$209,0)),\"\"))","v":"Ben Schneider"},"Warmmiete",{"v":700,"d":"700.00 €"},"Überweisung","Teilzahlung"]
[{"$f":"Mietübersicht!$B$3-29","v":"2026-01-03"},"2026-01-01","W-003",{"$f":"IF($C10=\"\",\"\",IFERROR(INDEX(Mietübersicht!$B$10:$B$209,MATCH($C10,Mietübersicht!$A$10:$A$209,0)),\"\"))","v":"Wohnung 3"},{"$f":"IF($C10=\"\",\"\",IFERROR(INDEX(Mietübersicht!$C$10:$C$209,MATCH($C10,Mietübersicht!$A$10:$A$209,0)),\"\"))","v":"Carla Wagner"},"Warmmiete",{"v":870,"d":"870.00 €"},"Überweisung","Jan Warmmiete"]
[{"$f":"Mietübersicht!$B$3+6","v":"2026-02-07"},"2026-02-01","W-002",{"$f":"IF($C11=\"\",\"\",IFERROR(INDEX(Mietübersicht!$B$10:$B$209,MATCH($C11,Mietübersicht!$A$10:$A$209,0)),\"\"))","v":"Wohnung 2"},{"$f":"IF($C11=\"\",\"\",IFERROR(INDEX(Mietübersicht!$C$10:$C$209,MATCH($C11,Mietübersicht!$A$10:$A$209,0)),\"\"))","v":"Ben Schneider"},"Sonstiges",{"v":50,"d":"50.00 €"},"Bar","Schlüsselgebühr"]
[null,"",null,{"$f":"IF($C12=\"\",\"\",IFERROR(INDEX(Mietübersicht!$B$10:$B$209,MATCH($C12,Mietübersicht!$A$10:$A$209,0)),\"\"))","v":""},{"$f":"IF($C12=\"\",\"\",IFERROR(INDEX(Mietübersicht!$C$10:$C$209,MATCH($C12,Mietübersicht!$A$10:$A$209,0)),\"\"))","v":""}]
[null,"",null,{"$f":"IF($C13=\"\",\"\",IFERROR(INDEX(Mietübersicht!$B$10:$B$209,MATCH($C13,Mietübersicht!$A$10:$A$209,0)),\"\"))","v":""},{"$f":"IF($C13=\"\",\"\",IFERROR(INDEX(Mietübersicht!$C$10:$C$209,MATCH($C13,Mietübersicht!$A$10:$A$209,0)),\"\"))","v":""}]
[null,"",null,{"$f":"IF($C14=\"\",\"\",IFERROR(INDEX(Mietübersicht!$B$10:$B$209,MATCH($C14,Mietübersicht!$A$10:$A$209,0)),\"\"))","v":""},{"$f":"IF($C14=\"\",\"\",IFERROR(INDEX(Mietübersicht!$C$10:$C$209,MATCH($C14,Mietübersicht!$A$10:$A$209,0)),\"\"))","v":""}]
[null,"",null,{"$f":"IF($C15=\"\",\"\",IFERROR(INDEX(Mietübersicht!$B$10:$B$209,MATCH($C15,Mietübersicht!$A$10:$A$209,0)),\"\"))","v":""},{"$f":"IF($C15=\"\",\"\",IFERROR(INDEX(Mietübersicht!$C$10:$C$209,MATCH($C15,Mietübersicht!$A$10:$A$209,0)),\"\"))","v":""}]
[null,"",null,{"$f":"IF($C16=\"\",\"\",IFERROR(INDEX(Mietübersicht!$B$10:$B$209,MATCH($C16,Mietübersicht!$A$10:$A$209,0)),\"\"))","v":""},{"$f":"IF($C16=\"\",\"\",IFERROR(INDEX(Mietübersicht!$C$10:$C$209,MATCH($C16,Mietübersicht!$A$10:$A$209,0)),\"\"))","v":""}]
[null,"",null,{"$f":"IF($C17=\"\",\"\",IFERROR(INDEX(Mietübersicht!$B$10:$B$209,MATCH($C17,Mietübersicht!$A$10:$A$209,0)),\"\"))","v":""},{"$f":"IF($C17=\"\",\"\",IFERROR(INDEX(Mietübersicht!$C$10:$C$209,MATCH($C17,Mietübersicht!$A$10:$A$209,0)),\"\"))","v":""}]
[null,"",null,{"$f":"IF($C18=\"\",\"\",IFERROR(INDEX(Mietübersicht!$B$10:$B$209,MATCH($C18,Mietübersicht!$A$10:$A$209,0)),\"\"))","v":""},{"$f":"IF($C18=\"\",\"\",IFERROR(INDEX(Mietübersicht!$C$10:$C$209,MATCH($C18,Mietübersicht!$A$10:$A$209,0)),\"\"))","v":""}]
[null,"",null,{"$f":"IF($C19=\"\",\"\",IFERROR(INDEX(Mietübersicht!$B$10:$B$209,MATCH($C19,Mietübersicht!$A$10:$A$209,0)),\"\"))","v":""},{"$f":"IF($C19=\"\",\"\",IFERROR(INDEX(Mietübersicht!$C$10:$C$209,MATCH($C19,Mietübersicht!$A$10:$A$209,0)),\"\"))","v":""}]
[null,"",null,{"$f":"IF($C20=\"\",\"\",IFERROR(INDEX(Mietübersicht!$B$10:$B$209,MATCH($C20,Mietübersicht!$A$10:$A$209,0)),\"\"))","v":""},{"$f":"IF($C20=\"\",\"\",IFERROR(INDEX(Mietübersicht!$C$10:$C$209,MATCH($C20,Mietübersicht!$A$10:$A$209,0)),\"\"))","v":""}]
[null,"",null,{"$f":"IF($C21=\"\",\"\",IFERROR(INDEX(Mietübersicht!$B$10:$B$209,MATCH($C21,Mietübersicht!$A$10:$A$209,0)),\"\"))","v":""},{"$f":"IF($C21=\"\",\"\",IFERROR(INDEX(Mietübersicht!$C$10:$C$209,MATCH($C21,Mietübersicht!$A$10:$A$209,0)),\"\"))","v":""}]
[null,"",null,{"$f":"IF($C22=\"\",\"\",IFERROR(INDEX(Mietübersicht!$B$10:$B$209,MATCH($C22,Mietübersicht!$A$10:$A$209,0)),\"\"))","v":""},{"$f":"IF($C22=\"\",\"\",IFERROR(INDEX(Mietübersicht!$C$10:$C$209,MATCH($C22,Mietübersicht!$A$10:$A$209,0)),\"\"))","v":""}]
[null,"",null,{"$f":"IF($C23=\"\",\"\",IFERROR(INDEX(Mietübersicht!$B$10:$B$209,MATCH($C23,Mietübersicht!$A$10:$A$209,0)),\"\"))","v":""},{"$f":"IF($C23=\"\",\"\",IFERROR(INDEX(Mietübersicht!$C$10:$C$209,MATCH($C23,Mietübersicht!$A$10:$A$209,0)),\"\"))","v":""}]
[null,"",null,{"$f":"IF($C24=\"\",\"\",IFERROR(INDEX(Mietübersicht!$B$10:$B$209,MATCH($C24,Mietübersicht!$A$10:$A$209,0)),\"\"))","v":""},{"$f":"IF($C24=\"\",\"\",IFERROR(INDEX(Mietübersicht!$C$10:$C$209,MATCH($C24,Mietübersicht!$A$10:$A$209,0)),\"\"))","v":""}]
[null,"",null,{"$f":"IF($C25=\"\",\"\",IFERROR(INDEX(Mietübersicht!$B$10:$B$209,MATCH($C25,Mietübersicht!$A$10:$A$209,0)),\"\"))","v":""},{"$f":"IF($C25=\"\",\"\",IFERROR(INDEX(Mietübersicht!$C$10:$C$209,MATCH($C25,Mietübersicht!$A$10:$A$209,0)),\"\"))","v":""}]
[null,"",null,{"$f":"IF($C26=\"\",\"\",IFERROR(INDEX(Mietübersicht!$B$10:$B$209,MATCH($C26,Mietübersicht!$A$10:$A$209,0)),\"\"))","v":""},{"$f":"IF($C26=\"\",\"\",IFERROR(INDEX(Mietübersicht!$C$10:$C$209,MATCH($C26,Mietübersicht!$A$10:$A$209,0)),\"\"))","v":""}]
[null,"",null,{"$f":"IF($C27=\"\",\"\",IFERROR(INDEX(Mietübersicht!$B$10:$B$209,MATCH($C27,Mietübersicht!$A$10:$A$209,0)),\"\"))","v":""},{"$f":"IF($C27=\"\",\"\",IFERROR(INDEX(Mietübersicht!$C$10:$C$209,MATCH($C27,Mietübersicht!$A$10:$A$209,0)),\"\"))","v":""}]
[null,"",null,{"$f":"IF($C28=\"\",\"\",IFERROR(INDEX(Mietübersicht!$B$10:$B$209,MATCH($C28,Mietübersicht!$A$10:$A$209,0)),\"\"))","v":""},{"$f":"IF($C28=\"\",\"\",IFERROR(INDEX(Mietübersicht!$C$10:$C$209,MATCH($C28,Mietübersicht!$A$10:$A$209,0)),\"\"))","v":""}]
[null,"",null,{"$f":"IF($C29=\"\",\"\",IFERROR(INDEX(Mietübersicht!$B$10:$B$209,MATCH($C29,Mietübersicht!$A$10:$A$209,0)),\"\"))","v":""},{"$f":"IF($C29=\"\",\"\",IFERROR(INDEX(Mietübersicht!$C$10:$C$209,MATCH($C29,Mietübersicht!$A$10:$A$209,0)),\"\"))","v":""}]
[null,"",null,{"$f":"IF($C30=\"\",\"\",IFERROR(INDEX(Mietübersicht!$B$10:$B$209,MATCH($C30,Mietübersicht!$A$10:$A$209,0)),\"\"))","v":""},{"$f":"IF($C30=\"\",\"\",IFERROR(INDEX(Mietübersicht!$C$10:$C$209,MATCH($C30,Mietübersicht!$A$10:$A$209,0)),\"\"))","v":""}]
[null,"",null,{"$f":"IF($C31=\"\",\"\",IFERROR(INDEX(Mietübersicht!$B$10:$B$209,MATCH($C31,Mietübersicht!$A$10:$A$209,0)),\"\"))","v":""},{"$f":"IF($C31=\"\",\"\",IFERROR(INDEX(Mietübersicht!$C$10:$C$209,MATCH($C31,Mietübersicht!$A$10:$A$209,0)),\"\"))","v":""}]
[null,"",null,{"$f":"IF($C32=\"\",\"\",IFERROR(INDEX(Mietübersicht!$B$10:$B$209,MATCH($C32,Mietübersicht!$A$10:$A$209,0)),\"\"))","v":""},{"$f":"IF($C32=\"\",\"\",IFERROR(INDEX(Mietübersicht!$C$10:$C$209,MATCH($C32,Mietübersicht!$A$10:$A$209,0)),\"\"))","v":""}]
[null,"",null,{"$f":"IF($C33=\"\",\"\",IFERROR(INDEX(Mietübersicht!$B$10:$B$209,MATCH($C33,Mietübersicht!$A$10:$A$209,0)),\"\"))","v":""},{"$f":"IF($C33=\"\",\"\",IFERROR(INDEX(Mietübersicht!$C$10:$C$209,MATCH($C33,Mietübersicht!$A$10:$A$209,0)),\"\"))","v":""}]
[null,"",null,{"$f":"IF($C34=\"\",\"\",IFERROR(INDEX(Mietübersicht!$B$10:$B$209,MATCH($C34,Mietübersicht!$A$10:$A$209,0)),\"\"))","v":""},{"$f":"IF($C34=\"\",\"\",IFERROR(INDEX(Mietübersicht!$C$10:$C$209,MATCH($C34,Mietübersicht!$A$10:$A$209,0)),\"\"))","v":""}]
[null,"",null,{"$f":"IF($C35=\"\",\"\",IFERROR(INDEX(Mietübersicht!$B$10:$B$209,MATCH($C35,Mietübersicht!$A$10:$A$209,0)),\"\"))","v":""},{"$f":"IF($C35=\"\",\"\",IFERROR(INDEX(Mietübersicht!$C$10:$C$209,MATCH($C35,Mietübersicht!$A$10:$A$209,0)),\"\"))","v":""}]
[null,"",null,{"$f":"IF($C36=\"\",\"\",IFERROR(INDEX(Mietübersicht!$B$10:$B$209,MATCH($C36,Mietübersicht!$A$10:$A$209,0)),\"\"))","v":""},{"$f":"IF($C36=\"\",\"\",IFERROR(INDEX(Mietübersicht!$C$10:$C$209,MATCH($C36,Mietübersicht!$A$10:$A$209,0)),\"\"))","v":""}]
[null,"",null,{"$f":"IF($C37=\"\",\"\",IFERROR(INDEX(Mietübersicht!$B$10:$B$209,MATCH($C37,Mietübersicht!$A$10:$A$209,0)),\"\"))","v":""},{"$f":"IF($C37=\"\",\"\",IFERROR(INDEX(Mietübersicht!$C$10:$C$209,MATCH($C37,Mietübersicht!$A$10:$A$209,0)),\"\"))","v":""}]
[null,{"$f":"IF(A38=\"\",\"\",DATE(YEAR(A38),MONTH(A38),1))","v":""},null,{"$f":"IF($C38=\"\",\"\",IFERROR(INDEX(Mietübersicht!$B$10:$B$209,MATCH($C38,Mietübersicht!$A$10:$A$209,0)),\"\"))","v":""},{"$f":"IF($C38=\"\",\"\",IFERROR(INDEX(Mietübersicht!$C$10:$C$209,MATCH($C38,Mietübersicht!$A$10:$A$209,0)),\"\"))","v":""}]
[null,"",null,{"$f":"IF($C39=\"\",\"\",IFERROR(INDEX(Mietübersicht!$B$10:$B$209,MATCH($C39,Mietübersicht!$A$10:$A$209,0)),\"\"))","v":""},{"$f":"IF($C39=\"\",\"\",IFERROR(INDEX(Mietübersicht!$C$10:$C$209,MATCH($C39,Mietübersicht!$A$10:$A$209,0)),\"\"))","v":""}]
[null,"",null,{"$f":"IF($C40=\"\",\"\",IFERROR(INDEX(Mietübersicht!$B$10:$B$209,MATCH($C40,Mietübersicht!$A$10:$A$209,0)),\"\"))","v":""},{"$f":"IF($C40=\"\",\"\",IFERROR(INDEX(Mietübersicht!$C$10:$C$209,MATCH($C40,Mietübersicht!$A$10:$A$209,0)),\"\"))","v":""}]
{"$rows_left_out":166}
{"sheet":"Ausgaben","index":2,"n_rows":205,"n_cols":11,"rows_kept":205,"merged":[[0,0,0,10]]}
["Ausgaben – Kosten & Instandhaltung"]
[]
[]
[]
["Datum","Monat","Objekt-ID","Kategorie","Beschreibung","Betrag (€)","Fällig am","Bezahlt?","Bezahlt am","Lieferant/Dienstleister","Rechnung-Nr."]
[{"$f":"Mietübersicht!$B$3+4","v":"2026-02-05"},{"$f":"IF(A6=\"\",\"\",DATE(YEAR(A6),MONTH(A6),1))","v":"2026-02-01"},"W-001","Instandhaltung","Klempner – Reparatur",{"v":180,"d":"180.00 €"},{"$f":"Mietübersicht!$B$3+11","v":"2026-02-12"},"Ja",{"$f":"Mietübersicht!$B$3+11","v":"2026-02-12"},"Sanitär Müller","RE-2026-021"]
[{"$f":"Mietübersicht!$B$3+7","v":"2026-02-08"},"2026-02-01","G-001","Verwaltung","Hausverwaltungssoftware",{"v":25,"d":"25.00 €"},{"$f":"Mietübersicht!$B$3+14","v":"2026-02-15"},"Nein",null,"SoftHaus GmbH","INV-8841"]
[{"$f":"Mietübersicht!$B$3+9","v":"2026-02-10"},"2026-02-01","W-002","Versicherung","Gebäudeversicherung (Anteil)",{"v":95,"d":"95.00 €"},{"$f":"Mietübersicht!$B$3+9","v":"2026-02-10"},"Ja",{"$f":"Mietübersicht!$B$3+9","v":"2026-02-10"},"Versicherer AG","2026-02-10"]
[{"$f":"Mietübersicht!$B$3+2","v":"2026-02-03"},"2026-02-01","W-003","Energie","Strom Allgemein",{"v":60,"d":"60.00 €"},{"$f":"Mietübersicht!$B$3+19","v":"2026-02-20"},"Nein",null,"Stadtwerke","SW-9932"]
[{"$f":"Mietübersicht!$B$3-12","v":"2026-01-20"},"2026-01-01","W-001","Sonstiges","Briefkasten-Schloss",{"v":18,"d":"18.00 €"},{"$f":"Mietübersicht!$B$3-4","v":"2026-01-28"},"Ja",{"$f":"Mietübersicht!$B$3-4","v":"2026-01-28"},"Schlüsseldienst","JAN-118"]
[null,""]
[null,""]
[null,""]
[null,""]
[null,""]
[null,""]
[null,""]
[null,""]
[null,""]
[null,""]
[null,""]
[null,""]
[null,""]
[null,""]
[null,""]
[null,""]
[null,""]
[null,""]
[null,""]
[null,""]
[null,""]
[null,""]
[null,""]
[null,""]
[null,""]
[null,""]
[null,""]
[null,{"$f":"IF(A38=\"\",\"\",DATE(YEAR(A38),MONTH(A38),1))","v":""}]
[null,""]
[null,""]
{"$rows_left_out":165}